Quantcast
Channel: Last error message
Browsing all 15 articles
Browse latest View live

error running shared postrotate script for /var/log/mysql.log

Error message:error: error running shared postrotate script for /var/log/mysql.log /var/log/mysql/mysql.log /var/log/mysql/mysql-slow.logrun-parts: /etc/cron.daily/logrotate exited with return code...

View Article



can't initialize ip6tables table

Error message:ip6tables v1.4.2: can't initialize ip6tables table `filter': iptables who? (do you need to insmod?)Perhaps ip6tables or your kernel needs to be upgraded.ip6tables v1.4.2: can't initialize...

View Article

open files exceed max cache size by

Error message:# tail -f /var/log/syslogJan 9 17:53:54 station mount.davfs: open files exceed max cache size by 1 MiBytesJan 9 17:54:04 station mount.davfs: open files exceed max cache size by 1...

View Article

error: failed to prepare transaction (could not satisfy dependencies)

Error message:resolving dependencies...looking for inter-conflicts...error: failed to prepare transaction (could not satisfy dependencies):: pacman-color: requires pacman=3.4.0How to resolve a...

View Article

Can't get CREATE TABLE for table `index_rel`

Error message:# mysqldump -u root -p tablename > mysql_dump_tablename.sqlEnter password:mysqldump: Can't get CREATE TABLE for table `index_rel` (Can't open file: 'index_rel.MYI'. (errno: 145))How to...

View Article


/usr/lib/mc/extfs.d/iso9660: 88: isoinfo: not found

Error message:/usr/lib/mc/extfs.d/iso9660: 88: isoinfo: not foundHow to resolve a problem:# apt-get install genisoimage

View Article

DB_RUNRECOVERY: Fatal error, run database recovery

Error message:# yum install vpncrpmdb: Thread/process 4486/3078768320 failed: Thread died in Berkeley DB libraryerror: db4 error(-30974) from dbenv->failchk: DB_RUNRECOVERY: Fatal error, run...

View Article

java.lang.ClassNotFoundException:...

Error message:No supported regular expression matcher found: java.lang.ClassNotFoundException: org.apache.tools.ant.util.regexp.Jdk14RegexpRegexpHow to resolve a problem:# apt-get install ant-optional

View Article


libbfd-2.20.1-system.20100303.so: cannot open shared object file: No such...

Error message:ardesia: error while loading shared libraries: libbfd-2.20.1-system.20100303.so: cannot open shared object file: No such file or directoryHow to resolve a problem:$ ls -al...

View Article


This client is too old to work with working copy

Error message:# svn statussvn: This client is too old to work with working copy 'rpc'. You needto get a newer Subversion client, or to downgrade this working copy.See...

View Article

Checking for package stfl... not found

Error message:# make...Checking for package stfl... not foundHow to resolve a problem:# cd /usr/local/src# wget http://www.clifford.at/stfl/stfl-0.20.tar.gz# tar -xzf stfl-0.20.tar.gz# cd...

View Article

Invalid command 'ProxyRequests'

Error message:# /etc/init.d/apache2 restartInvalid command 'ProxyRequests', perhaps mis-spelled or defined by a module not included in the server configurationHow to resolve a problem:# a2enmod proxy#...

View Article

Failed to exec method /usr/lib/apt/methods/

Error message:# apt-get updateFailed to exec method /usr/lib/apt/methods/Failed to exec method /usr/lib/apt/methods/E: Method has died unexpectedly!E: Sub-process returned an error code (100)E: Method...

View Article


Unknown setting: ssl_disable

Error message:# /etc/init.d/dovecot restartRestarting IMAP/POP3 mail server: dovecotError: Error in configuration file /etc/dovecot/dovecot.conf line 6: Unknown setting: ssl_disableFatal: Invalid...

View Article

CPU#0 stuck for 11s! [modprobe:1292]

Error message:CPU#0 stuck for 11s! [modprobe:1292]How to resolve a problem:# vim /boot/grub/menu.lstfrom:/boot/vmlinuz-2.6.32-5-686 root=UUID=.. ro quietto:/boot/vmlinuz-2.6.32-5-686 root=UUID=.. ro

View Article

Browsing all 15 articles
Browse latest View live




Latest Images